Ubuntu error when compiling the libsigrok4DSL

Help to track any bugs about DSView software
Hi,

Issue noticed in Ubuntu 14.04

After downloading the latest version of DSview (git clone git://github.com/DreamSourceLab/DSView) , after checking all the dependencies, when i try to compile libsigrok4DSL i receive the following error:

session_file.c: In function 'sr_session_append':
session_file.c:476:5: warning: implicit declaration of function 'zip_file_add' [-Wimplicit-function-declaration]
if (zip_file_add(archive, chunk_name, logicsrc, ZIP_FL_OVERWRITE) == -1) {
^
session_file.c:476:53: error: 'ZIP_FL_OVERWRITE' undeclared (first use in this function)
if (zip_file_add(archive, chunk_name, logicsrc, ZIP_FL_OVERWRITE) == -1) {
^
session_file.c:476:53: note: each undeclared identifier is reported only once for each function it appears in
make[2]: *** [session_file.lo] Error 1
make[1]: *** [all-recursive] Error 1
make: *** [all] Error 2


Any idea about this error?
Laur
 
Posts: 1
Joined: Wed Jul 05, 2017 11:07 pm

Return to Bugs Report

Who is online
Users browsing this forum: No registered users and 1 guest
cron