DSView Compile failure on Ubuntu 15.10

Topics about DSLogic software development
I get this error. I have installed qtbase5-dev. Not sure what this means. :(

salman@salman-Satellite:~/Downloads/DSView-master/DSView$ make
[ 0%] Building CXX object CMakeFiles/DSView.dir/pv/data/decoderstack.cpp.o
/home/salman/Downloads/DSView-master/DSView/pv/data/decoderstack.cpp: In member function ‘void pv::data::DecoderStack::decode_data(uint64_t, unsigned int, srd_session*)’:
/home/salman/Downloads/DSView-master/DSView/pv/data/decoderstack.cpp:357:55: error: too many arguments to function ‘int srd_session_send(srd_session*, uint64_t, uint64_t, const uint8_t*, uint64_t)’
(chunk_end - i) * unit_size, unit_size) != SRD_OK) {
^
In file included from /home/salman/Downloads/DSView-master/DSView/pv/data/decoderstack.cpp:20:0:
/usr/local/include/libsigrokdecode/libsigrokdecode.h:278:13: note: declared here
SRD_API int srd_session_send(struct srd_session *sess,
^
CMakeFiles/DSView.dir/build.make:1701: recipe for target 'CMakeFiles/DSView.dir/pv/data/decoderstack.cpp.o' failed
make[2]: *** [CMakeFiles/DSView.dir/pv/data/decoderstack.cpp.o] Error 1
CMakeFiles/Makefile2:60: recipe for target 'CMakeFiles/DSView.dir/all' failed
make[1]: *** [CMakeFiles/DSView.dir/all] Error 2
Makefile:136: recipe for target 'all' failed
make: *** [all] Error 2
salmanisheikh
 
Posts: 4
Joined: Fri Sep 05, 2014 10:57 am

Return to DSLogic Software

Who is online
Users browsing this forum: No registered users and 1 guest
cron